make: *** [ext/posix/posix.lo] Error 1 During PHP Compile

Discussion in 'Install/Configuration' started by .Bob, Jul 31, 2008.

  1. .Bob

    .Bob New Member


    I am trying to compile PHP via the admin console on the latest version of LiteSpeed enterprise.

    Compile always fails for both php5/php4. I've checked the log files and I noticed

    /usr/local/lsws/phpbuild/php-5.2.6/ext/posix/posix.c: In function 'zif_posix_uname':
    /usr/local/lsws/phpbuild/php-5.2.6/ext/posix/posix.c:471: error: 'struct utsname' has no member named 'domainname'
    make: *** [ext/posix/posix.lo] Error 1

    I dont know what is wrong. Any suggestions?

  2. mistwang

    mistwang LiteSpeed Staff

    What's your OS?
  3. .Bob

    .Bob New Member

    We are running CentOS Linux 5.2
  4. mistwang

    mistwang LiteSpeed Staff

  5. .Bob

    .Bob New Member

Share This Page